Target
Botulinum neurotoxin type A
Ligand
BDBM50129806
Substrate
Meas. Tech.
ChEMBL_1523900 (CHEMBL3630045)
Ki
46±n/a nM
Citation
 Kumaran, DAdler, MLevit, MKrebs, MSweeney, RSwaminathan, S Interactions of a potent cyclic peptide inhibitor with the light chain of botulinum neurotoxin A: Insights from X-ray crystallography. Bioorg Med Chem 23:7264-73 (2015)  
Target
Name:
Botulinum neurotoxin type A
Synonyms:
BXA1_CLOBO bonT | botA
Type:
PROTEIN
Mol. Mass.:
149450.01
Organism:
Clostridium botulinum
Description:
ChEMBL_1510137
Residue:
1296
  
Inhibitor
Name:
BDBM50129806
Synonyms:
CHEMBL3627987
Type:
Small organic molecule
Emp. Form.:
C43H71N15O9S2
Mol. Mass.:
1006.249
SMILES:
[H][C@]1(NC(=O)[C@H](Cc2cc3ccccc3[nH]2)NC(=O)[C@H](CCCNC(N)=N)NC(=O)[C@@H](N)CCNC(=O)[C@@H](N)CSSC[C@H](NC(=O)[C@H](CCCCN)NC1=O)C(=O)N[C@@H](CC(C)C)C(N)=O)[C@H](C)O
: