Target
MAP kinase-interacting serine/threonine-protein kinase 2
Ligand
BDBM50130694
Substrate
Meas. Tech.
ChEMBL_1527068 (CHEMBL3637759)
Ki
79±n/a nM
Citation
 Teo, TYang, YYu, MBasnet, SKGillam, THou, JSchmid, RMKumarasiri, MDiab, SAlbrecht, HSykes, MJWang, S An integrated approach for discovery of highly potent and selective Mnk inhibitors: Screening, synthesis and SAR analysis. Eur J Med Chem 103:539-50 (2015)  
Target
Name:
MAP kinase-interacting serine/threonine-protein kinase 2
Synonyms:
GPRK7 MAP kinase-interacting serine/threonine-protein kinase 2 (MKNK2) MAP-kinase interacting kinase 2 (MNK2) MKNK2_HUMAN | MNK2
Type:
Protein
Mol. Mass.:
51870.79
Organism:
Homo sapiens (Human)
Description:
Q9HBH9
Residue:
465
  
Inhibitor
Name:
BDBM50130694
Synonyms:
CHEMBL3416305
Type:
Small organic molecule
Emp. Form.:
C16H13NO7
Mol. Mass.:
331.2769
SMILES:
CC(=O)C1=C(O)C=C2Oc3c(c(O)cc(O)c3C(N)=O)[C@@]2(C)C1=O
: