Target
Kinesin-like protein KIF11
Ligand
BDBM50131856
Substrate
Meas. Tech.
ChEMBL_1526764 (CHEMBL3636399)
IC50
21±n/a nM
Citation
 Ogo, NIshikawa, YSawada, JMatsuno, KHashimoto, AAsai, A Structure-Guided Design of Novel l-Cysteine Derivatives as Potent KSP Inhibitors. ACS Med Chem Lett 6:1004-9 (2015)  
Target
Name:
Kinesin-like protein KIF11
Synonyms:
EG5 KIF11_HUMAN Kinesin Spindle Protein Eg5 TRIP5 | kinesin spindle protein
Type:
PROTEIN
Mol. Mass.:
119138.97
Organism:
Homo sapiens (Human)
Description:
ChEMBL_1457426
Residue:
1056
  
Inhibitor
Name:
BDBM50131856
Synonyms:
CHEMBL3633365
Type:
Small organic molecule
Emp. Form.:
C25H22F3NO2S
Mol. Mass.:
457.508
SMILES:
N[C@@H](CSC1(c2ccc(cc2)C(F)(F)F)c2ccccc2CCc2ccccc12)C(O)=O
: