Target
Carbonic anhydrase, alpha family
Ligand
BDBM10886
Substrate
Meas. Tech.
ChEMBL_1543854 (CHEMBL3749744)
Ki
2.7±n/a nM
Citation
 Vullo, DBhatt, AMahon, BPMcKenna, RSupuran, CT Sulfonamide inhibition studies of thea-carbonic anhydrase from the gammaproteobacterium Thiomicrospira crunogena XCL-2, TcruCA. Bioorg Med Chem Lett 26:401-5 (2016)  
Target
Name:
Carbonic anhydrase, alpha family
Synonyms:
Carbonic anhydrase, alpha family
Type:
PROTEIN
Mol. Mass.:
35831.01
Organism:
Thiomicrospira crunogena (strain XCL-2)
Description:
ChEMBL_109899
Residue:
315
  
Inhibitor
Name:
BDBM10886
Synonyms:
2-N-benzene-1,3,4-thiadiazole-2,5-disulfonamide Benzolamide CHEMBL73962
Type:
Small organic molecule
Emp. Form.:
C8H8N4O4S3
Mol. Mass.:
320.369
SMILES:
NS(=O)(=O)c1nnc(NS(=O)(=O)c2ccccc2)s1
: