Target
5-hydroxytryptamine receptor 2A
Ligand
BDBM50134680
Substrate
Meas. Tech.
ChEMBL_1545083 (CHEMBL3750143)
Ki
429±n/a nM
Citation
 Canale, VKurczab, RPartyka, ASatala, GSloczynska, KKos, TJastrzebska-Wiesek, MSiwek, APekala, EBojarski, AJWesolowska, APopik, PZajdel, P N-Alkylated arylsulfonamides of (aryloxy)ethyl piperidines: 5-HT(7) receptor selectivity versus multireceptor profile. Bioorg Med Chem 24:130-9 (2016)  
Target
Name:
5-hydroxytryptamine receptor 2A
Synonyms:
5-HT-2 5-HT2A 5-hydroxytryptamine receptor 2A (5HT-2A) 5HT2A_HUMAN HTR2A | Serotonin receptor 2A
Type:
undefined
Mol. Mass.:
52607.65
Organism:
Homo sapiens (Human)
Description:
P28223
Residue:
471
  
Inhibitor
Name:
BDBM50134680
Synonyms:
CHEMBL3747148
Type:
Small organic molecule
Emp. Form.:
C26H35FN2O3S
Mol. Mass.:
474.631
SMILES:
CC(C)c1ccccc1OCCN1CCC(CC1)N(CC1CC1)S(=O)(=O)c1cccc(F)c1
: