Target
Lysine-specific histone demethylase 2
Ligand
BDBM50445336
Substrate
Meas. Tech.
ChEBML_1554333
IC50
26000±n/a nM
Citation
 Kakizawa, TMizukami, TItoh, YHasegawa, MSasaki, RSuzuki, T Evaluation of phenylcyclopropylamine compounds by enzymatic assay of lysine-specific demethylase 2 in the presence of NPAC peptide. Bioorg Med Chem Lett 26:1193-5 (2016)  
Target
Name:
Lysine-specific histone demethylase 2
Synonyms:
AOF1 Flavin-containing amine oxidase domain-containing protein 1 KDM1B_HUMAN Lysine-specific histone demethylase 1B | Lysine-specific histone demethylase 2
Type:
PROTEIN
Mol. Mass.:
92112.91
Organism:
Homo sapiens (Human)
Description:
ChEMBL_992590
Residue:
822
  
Inhibitor
Name:
BDBM50445336
Synonyms:
CHEMBL1797639
Type:
Small organic molecule
Emp. Form.:
C27H29N3O3
Mol. Mass.:
443.5375
SMILES:
NC1CC1c1cccc(OCC[C@H](NC(=O)c2ccccc2)C(=O)NCc2ccccc2)c1
: