Target
Stromelysin-1
Ligand
BDBM50305851
Substrate
Meas. Tech.
ChEMBL_1552496 (CHEMBL3761850)
Ki
>10000±n/a nM
Citation
 Ruminski, PGMassa, MStrohbach, JHanau, CESchmidt, MScholten, JAFletcher, TRHamper, BCCarroll, JNShieh, HSCaspers, NCollins, BGrapperhaus, MPalmquist, KECollins, JBaldus, JEHitchcock, JKleine, HPRogers, MDMcDonald, JMunie, GEMessing, DMPortolan, SWhiteley, LOSunyer, TSchnute, ME Discovery of N-(4-Fluoro-3-methoxybenzyl)-6-(2-(((2S,5R)-5-(hydroxymethyl)-1,4-dioxan-2-yl)methyl)-2H-tetrazol-5-yl)-2-methylpyrimidine-4-carboxamide. A Highly Selective and Orally Bioavailable Matrix Metalloproteinase-13 Inhibitor for the Potential Treatment of Osteoarthritis. J Med Chem 59:313-27 (2016)  
Target
Name:
Stromelysin-1
Synonyms:
MMP-3 MMP3_HUMAN Matrix metalloproteinase 3 Matrix metalloproteinase-3 (MMP-3) SL-1 Stromelysin 1 | Transin-1
Type:
Enzyme
Mol. Mass.:
53973.13
Organism:
Homo sapiens (Human)
Description:
P08254
Residue:
477
  
Inhibitor
Name:
BDBM50305851
Synonyms:
CHEMBL596273 | trans-4-((5-(2-(3-methoxybenzylcarbamoyl)-6-methylpyridin-4-yl)-2H-tetrazol-2-yl)methyl)cyclohexanecarboxylic acid
Type:
Small organic molecule
Emp. Form.:
C24H28N6O4
Mol. Mass.:
464.5169
SMILES:
COc1cccc(CNC(=O)c2cc(cc(C)n2)-c2nnn(C[C@H]3CC[C@@H](CC3)C(O)=O)n2)c1
: