Target
5-hydroxytryptamine receptor 1A
Ligand
BDBM50145612
Substrate
Meas. Tech.
ChEMBL_1556024 (CHEMBL3767883)
Ki
9.2±n/a nM
Citation
 Fiorino, FCiano, AMagli, ESeverino, BCorvino, APerissutti, EFrecentese, FDi Vaio, PIzzo, AACapasso, RMassarelli, PNencini, CRossi, IKedzierska, EOrzelska-Gòrka, JBielenica, ASantagada, VCaliendo, G Synthesis, in vitro and in vivo pharmacological evaluation of serotoninergic ligands containing an isonicotinic nucleus. Eur J Med Chem 110:133-50 (2016)  
Target
Name:
5-hydroxytryptamine receptor 1A
Synonyms:
5-HT-1A 5-HT1A 5-hydroxytryptamine receptor 1A (5HT1A) 5ht1a Htr1a Serotonin 1a (5-HT1a) receptor/Adrenergic receptor alpha-1 | Serotonin receptor 1A
Type:
G Protein-Coupled Receptor (GPCR)
Mol. Mass.:
46445.29
Organism:
Rattus norvegicus (rat)
Description:
Binding assays were performed using rat hippocampal membranes.
Residue:
422
  
Inhibitor
Name:
BDBM50145612
Synonyms:
CHEMBL3764177
Type:
Small organic molecule
Emp. Form.:
C17H22N6O
Mol. Mass.:
326.3962
SMILES:
O=C(NCCCN1CCN(CC1)c1ncccn1)c1ccncc1
: