Target
Tryptophan 5-hydroxylase 1
Ligand
BDBM50145646
Substrate
Meas. Tech.
ChEMBL_1556269 (CHEMBL3769268)
IC50
1407±n/a nM
Citation
 Goldberg, DRDe Lombaert, SAiello, RBourassa, PBarucci, NZhang, QParalkar, VValentine, JZavadoski, W Discovery of spirocyclic proline tryptophan hydroxylase-1 inhibitors. Bioorg Med Chem Lett 26:1124-9 (2016)  
Target
Name:
Tryptophan 5-hydroxylase 1
Synonyms:
TPH TPH1_HUMAN TRPH | Tryptophan 5-monooxygenase 1
Type:
PROTEIN
Mol. Mass.:
50990.64
Organism:
Homo sapiens (Human)
Description:
ChEMBL_1361824
Residue:
444
  
Inhibitor
Name:
BDBM50145646
Synonyms:
CHEMBL3763702
Type:
Small organic molecule
Emp. Form.:
C24H27ClF3N7O3
Mol. Mass.:
553.964
SMILES:
Cc1ccn(n1)-c1cc(Cl)ccc1[C@@H](Oc1cc(nc(N)n1)N1CCC(C)(CC1)NCC(O)=O)C(F)(F)F
: