Target
Bromodomain-containing protein 1
Ligand
BDBM50148475
Substrate
Meas. Tech.
ChEMBL_1558046 (CHEMBL3771490)
IC50
1700±n/a nM
Citation
 Bennett, JFedorov, OTallant, CMonteiro, OMeier, JGamble, VSavitsky, PNunez-Alonso, GAHaendler, BRogers, CBrennan, PEMüller, SKnapp, S Discovery of a Chemical Tool Inhibitor Targeting the Bromodomains of TRIM24 and BRPF. J Med Chem 59:1642-7 (2016)  
Target
Name:
Bromodomain-containing protein 1
Synonyms:
BR140-like protein BRD1_HUMAN BRL Bromodomain and PHD finger-containing protein 2 | Bromodomain-containing protein 1
Type:
PROTEIN
Mol. Mass.:
119557.65
Organism:
Homo sapiens (Human)
Description:
ChEMBL_105349
Residue:
1058
  
Inhibitor
Name:
BDBM50148475
Synonyms:
CHEMBL3770465
Type:
Small organic molecule
Emp. Form.:
C22H21N3O4S
Mol. Mass.:
423.485
SMILES:
Cc1ccccc1S(=O)(=O)Nc1cc2n(C)c(=O)n(C)c2cc1Oc1ccccc1
: