Target
Bromodomain-containing protein 1
Ligand
BDBM50148477
Substrate
Meas. Tech.
ChEMBL_1558046 (CHEMBL3771490)
IC50
2670±n/a nM
Citation
 Bennett, JFedorov, OTallant, CMonteiro, OMeier, JGamble, VSavitsky, PNunez-Alonso, GAHaendler, BRogers, CBrennan, PEMüller, SKnapp, S Discovery of a Chemical Tool Inhibitor Targeting the Bromodomains of TRIM24 and BRPF. J Med Chem 59:1642-7 (2016)  
Target
Name:
Bromodomain-containing protein 1
Synonyms:
BR140-like protein BRD1_HUMAN BRL Bromodomain and PHD finger-containing protein 2 | Bromodomain-containing protein 1
Type:
PROTEIN
Mol. Mass.:
119557.65
Organism:
Homo sapiens (Human)
Description:
ChEMBL_105349
Residue:
1058
  
Inhibitor
Name:
BDBM50148477
Synonyms:
CHEMBL3771230
Type:
Small organic molecule
Emp. Form.:
C25H25N3O4S
Mol. Mass.:
463.549
SMILES:
Cn1c2cc(NS(=O)(=O)c3ccc4CCCCc4c3)c(Oc3ccccc3)cc2n(C)c1=O
: