Target
Lysine-specific histone demethylase 1A
Ligand
BDBM50151588
Substrate
Meas. Tech.
ChEMBL_1561055 (CHEMBL3776538)
IC50
610±n/a nM
Citation
 Itoh, YAihara, KMellini, PTojo, TOta, YTsumoto, HSolomon, VRZhan, PSuzuki, MOgasawara, DShigenaga, AInokuma, TNakagawa, HMiyata, NMizukami, TOtaka, ASuzuki, T Identification of SNAIL1 Peptide-Based Irreversible Lysine-Specific Demethylase 1-Selective Inactivators. J Med Chem 59:1531-44 (2016)  
Target
Name:
Lysine-specific histone demethylase 1A
Synonyms:
AOF2 Flavin-containing amine oxidase domain-containing protein 2 KDM1A KIAA0601 Lysine-specific demethylase 1 (LSD1) Lysine-specific histone demethylase 1 (LSD1)
Type:
Enzyme
Mol. Mass.:
92901.01
Organism:
Homo sapiens (Human)
Description:
O60341
Residue:
852
  
Inhibitor
Name:
BDBM50151588
Synonyms:
CHEMBL3775735
Type:
Small organic molecule
Emp. Form.:
C23H28N2O2
Mol. Mass.:
364.4806
SMILES:
OC(=O)c1ccc(CN2CCC(CN[C@H]3C[C@@H]3c3ccccc3)CC2)cc1
: