Target
Lysine-specific demethylase 4E
Ligand
BDBM50153322
Substrate
Meas. Tech.
ChEMBL_1562434 (CHEMBL3778170)
IC50
40±n/a nM
Citation
 Westaway, SMPreston, AGBarker, MDBrown, FBrown, JACampbell, MChung, CWDiallo, HDouault, CDrewes, GEagle, RGordon, LHaslam, CHayhow, TGHumphreys, PGJoberty, GKatso, RKruidenier, LLeveridge, MLiddle, JMosley, JMuelbaier, MRandle, RRioja, IRueger, ASeal, GASheppard, RJSingh, OTaylor, JThomas, PThomson, DWilson, DMLee, KPrinjha, RK Cell Penetrant Inhibitors of the KDM4 and KDM5 Families of Histone Lysine Demethylases. 1. 3-Amino-4-pyridine Carboxylate Derivatives. J Med Chem 59:1357-69 (2016)  
Target
Name:
Lysine-specific demethylase 4E
Synonyms:
2-OG-Dependent Histone Demethylase JMJD2E Jumonji domain-containing protein 2E (JMJD2E) KDM4DL KDM4E_HUMAN Lysine-specific demethylase 4E | Lysine-specific demethylase 4E (KDM4E)
Type:
Enzyme
Mol. Mass.:
56815.71
Organism:
Homo sapiens (Human)
Description:
B2RXH2
Residue:
506
  
Inhibitor
Name:
BDBM50153322
Synonyms:
CHEMBL3775612
Type:
Small organic molecule
Emp. Form.:
C13H12N2O2
Mol. Mass.:
228.2466
SMILES:
OC(=O)c1ccncc1NCc1ccccc1
: