Target
ATP-dependent translocase ABCB1
Ligand
BDBM50153731
Substrate
Meas. Tech.
ChEBML_1561530
Ki
500±n/a nM
Citation
 Callies, OSánchez-Cañete, MPGamarro, FJiménez, IACastanys, SBazzocchi, IL Optimization by Molecular Fine Tuning of Dihydro-ß-agarofuran Sesquiterpenoids as Reversers of P-Glycoprotein-Mediated Multidrug Resistance. J Med Chem 59:1880-90 (2016)  
Target
Name:
ATP-dependent translocase ABCB1
Synonyms:
ABCB1 MDR1_HUMAN Multidrug resistance protein 1 P-glycoprotein (P-gp) PGY1
Type:
Protein
Mol. Mass.:
141503.50
Organism:
Homo sapiens (Human)
Description:
P08183
Residue:
1280
  
Inhibitor
Name:
BDBM50153731
Synonyms:
CHEMBL3775149
Type:
Small organic molecule
Emp. Form.:
C33H36O8
Mol. Mass.:
560.6341
SMILES:
[H][C@@]12O[C@@]3(C)CC[C@H](OC(C)=O)[C@@]4(C)[C@@H](OC(=O)c5ccccc5)[C@@H](OC(=O)\C=C\c5ccccc5)[C@@]1([H])C(C)(C)O[C@@]234
: