Target
Tyrosine-protein kinase HCK
Ligand
BDBM14840
Substrate
Meas. Tech.
ChEMBL_1563501 (CHEMBL3783186)
IC50
901±n/a nM
Citation
 Onions, STIto, KCharron, CEBrown, RJColucci, MFrickel, FHardy, GJoly, KKing-Underwood, JKizawa, YKnowles, IMurray, PJNovak, ARani, ARapeport, GSmith, AStrong, PTaddei, DMWilliams, JG Discovery of Narrow Spectrum Kinase Inhibitors: New Therapeutic Agents for the Treatment of COPD and Steroid-Resistant Asthma. J Med Chem 59:1727-46 (2016)  
Target
Name:
Tyrosine-protein kinase HCK
Synonyms:
HCK Hematopoietic cell kinase p59-HCK/p60-HCK p61Hck
Type:
Enzyme Catalytic Domain
Mol. Mass.:
59600.18
Organism:
Homo sapiens (Human)
Description:
P08631
Residue:
526
  
Inhibitor
Name:
BDBM14840
Synonyms:
1-(5-tert-Butyl-2-p-tolyl-2H-pyrazol-3-yl)-3-[4-(2-pyridin-4-yl-ethoxy)-naphthalen-1-yl]-urea BIRB-796 Analog 30 | diaryl urea compound 9
Type:
Small organic molecule
Emp. Form.:
C32H33N5O2
Mol. Mass.:
519.6367
SMILES:
Cc1ccc(cc1)-n1nc(cc1NC(=O)Nc1ccc(OCCc2ccncc2)c2ccccc12)C(C)(C)C
: