Target
Nucleosome-remodeling factor subunit BPTF
Ligand
BDBM50157526
Substrate
Meas. Tech.
ChEBML_1569651
Kd
2800±n/a nM
Citation
 Romero, FATaylor, AMCrawford, TDTsui, VCôté, AMagnuson, S Disrupting Acetyl-Lysine Recognition: Progress in the Development of Bromodomain Inhibitors. J Med Chem 59:1271-98 (2016)  
Target
Name:
Nucleosome-remodeling factor subunit BPTF
Synonyms:
BPTF Bromodomain and PHD finger-containing transcription factor FALZ Fetal Alzheimer antigen
Type:
PROTEIN
Mol. Mass.:
338257.07
Organism:
Homo sapiens (Human)
Description:
ChEMBL_107969
Residue:
3046
  
Inhibitor
Name:
BDBM50157526
Synonyms:
CHEMBL586426 TCMDC-133606
Type:
Small organic molecule
Emp. Form.:
C23H23FN6O3
Mol. Mass.:
450.4655
SMILES:
COC(=O)c1cccc(NC(=O)NC2CCN(C2)c2ccnc(Nc3ccc(F)cc3)n2)c1
: