Target
Bromodomain-containing protein 4
Ligand
BDBM50158691
Substrate
Meas. Tech.
ChEMBL_1569675 (CHEMBL3791148)
IC50
<1000±n/a nM
Citation
 Romero, FATaylor, AMCrawford, TDTsui, VCôté, AMagnuson, S Disrupting Acetyl-Lysine Recognition: Progress in the Development of Bromodomain Inhibitors. J Med Chem 59:1271-98 (2016)  
Target
Name:
Bromodomain-containing protein 4
Synonyms:
BRD4 Bromodomain-containing protein 4 (BRD4) Protein HUNK1
Type:
Protein
Mol. Mass.:
152264.84
Organism:
Homo sapiens (Human)
Description:
O60885
Residue:
1362
  
Inhibitor
Name:
BDBM50158691
Synonyms:
CHEMBL3785891
Type:
Small organic molecule
Emp. Form.:
C20H19ClN2O2
Mol. Mass.:
354.83
SMILES:
CC1=C(CCC1=O)Nc1ccc(cc1Cl)C(=O)Nc1ccccc1C
: