Target
CREB-binding protein
Ligand
BDBM50151663
Substrate
Meas. Tech.
ChEMBL_1569633 (CHEMBL3790859)
Kd
151±n/a nM
Citation
 Romero, FATaylor, AMCrawford, TDTsui, VCôté, AMagnuson, S Disrupting Acetyl-Lysine Recognition: Progress in the Development of Bromodomain Inhibitors. J Med Chem 59:1271-98 (2016)  
Target
Name:
CREB-binding protein
Synonyms:
CBP CREB-binding protein (CBP) CREBBP
Type:
Transcription Coactivator
Mol. Mass.:
265411.66
Organism:
Homo sapiens (Human)
Description:
Q92793
Residue:
2442
  
Inhibitor
Name:
BDBM50151663
Synonyms:
CHEMBL3774655
Type:
Small organic molecule
Emp. Form.:
C27H36N2O5
Mol. Mass.:
468.5851
SMILES:
CCC(=O)N1CCOc2c(C1)cc(cc2OC[C@H]1CCCN(C)C1)-c1ccc(OC)c(OC)c1
: