Target
Coagulation factor X
Ligand
BDBM50158161
Substrate
Meas. Tech.
ChEMBL_1565757 (CHEMBL3782597)
Ki
750±n/a nM
Citation
 Venukadasula, PKOwusu, BYBansal, NRoss, LJHobrath, JVBao, DTruss, JWStackhouse, MMessick, TEKlampfer, LGalemmo, RA Design and Synthesis of Nonpeptide Inhibitors of Hepatocyte Growth Factor Activation. ACS Med Chem Lett 7:177-81 (2016)  
Target
Name:
Coagulation factor X
Synonyms:
Activated coagulation factor X (FXa) Coagulation factor X precursor F10 Factor X heavy chain Factor Xa Stuart-Prower factor
Type:
Enzyme
Mol. Mass.:
54726.60
Organism:
Homo sapiens (Human)
Description:
Residue:
488
  
Inhibitor
Name:
BDBM50158161
Synonyms:
CHEMBL3781405
Type:
Small organic molecule
Emp. Form.:
C32H38N6O2
Mol. Mass.:
538.6831
SMILES:
NC(=N)c1cccc(c1)N1CC(CNC(=O)c2ccccc2)CN(CC2CCN(Cc3ccccc3)CC2)C1=O
: