Target
Lysine-specific demethylase 2A
Ligand
BDBM50158853
Substrate
Meas. Tech.
ChEMBL_1566071 (CHEMBL3791458)
Ki
1500±n/a nM
Citation
 McAllister, TEEngland, KSHopkinson, RJBrennan, PEKawamura, ASchofield, CJ Recent Progress in Histone Demethylase Inhibitors. J Med Chem 59:1308-29 (2016)  
Target
Name:
Lysine-specific demethylase 2A
Synonyms:
AA1-1162 F-box and leucine-rich repeat protein 11 FBL7 Homo sapiens lysine demethylase 2A (KDM2A) KDM2A KIAA1004 Lysine-specific demethylase 2A (KDM2A) | NM_012308
Type:
Enzyme Catalytic Domain
Mol. Mass.:
132809.04
Organism:
Homo sapiens (Human)
Description:
Residue:
1162
  
Inhibitor
Name:
BDBM50158853
Synonyms:
CHEMBL3786188
Type:
Small organic molecule
Emp. Form.:
C24H19N3O2S2
Mol. Mass.:
445.557
SMILES:
Cc1ccc(cc1)N1N=C(SC11SCC(=O)N1c1ccccc1)C(=O)c1ccccc1
: