Target
Lysine-specific demethylase 4B
Ligand
BDBM50158857
Substrate
Meas. Tech.
ChEMBL_1566331 (CHEMBL3789210)
IC50
<250±n/a nM
Citation
 McAllister, TEEngland, KSHopkinson, RJBrennan, PEKawamura, ASchofield, CJ Recent Progress in Histone Demethylase Inhibitors. J Med Chem 59:1308-29 (2016)  
Target
Name:
Lysine-specific demethylase 4B
Synonyms:
JHDM3B JmjC domain-containing histone demethylation protein 3B KDM4B KIAA0876
Type:
PROTEIN
Mol. Mass.:
121904.33
Organism:
Homo sapiens (Human)
Description:
ChEMBL_109446
Residue:
1096
  
Inhibitor
Name:
BDBM50158857
Synonyms:
CHEMBL3787547
Type:
Small organic molecule
Emp. Form.:
C15H25N3O
Mol. Mass.:
263.3785
SMILES:
CCN(CC)CCCCNCc1cc(C=O)ccn1
: