Target
Lysine-specific demethylase 5B
Ligand
BDBM50158859
Substrate
Meas. Tech.
ChEMBL_1566343 (CHEMBL3789447)
IC50
<1000±n/a nM
Citation
 McAllister, TEEngland, KSHopkinson, RJBrennan, PEKawamura, ASchofield, CJ Recent Progress in Histone Demethylase Inhibitors. J Med Chem 59:1308-29 (2016)  
Target
Name:
Lysine-specific demethylase 5B
Synonyms:
CT31 Histone demethylase JARID1B Jumonji/ARID domain-containing protein 1B KDM5B_HUMAN Lysine-specific demethylase 5B (KDM5Flag-5B-FL) PLU1 RBP2-H1 | Retinoblastoma-binding protein 2 homolog 1
Type:
Protein
Mol. Mass.:
175659.67
Organism:
Homo sapiens (Human)
Description:
Q9UGL1
Residue:
1544
  
Inhibitor
Name:
BDBM50158859
Synonyms:
CHEMBL3787193
Type:
Small organic molecule
Emp. Form.:
C16H26N4O3
Mol. Mass.:
322.4026
SMILES:
CCN(CCN(C)C)C(=O)CNCc1cc(ccn1)C(=O)OC
: