Target
Amine oxidase [flavin-containing] A
Ligand
BDBM50158875
Substrate
Meas. Tech.
ChEMBL_1565800 (CHEMBL3789185)
IC50
>1000±n/a nM
Citation
 McAllister, TEEngland, KSHopkinson, RJBrennan, PEKawamura, ASchofield, CJ Recent Progress in Histone Demethylase Inhibitors. J Med Chem 59:1308-29 (2016)  
Target
Name:
Amine oxidase [flavin-containing] A
Synonyms:
AOFA_HUMAN MAO-A Monoamine oxidase Monoamine oxidase type A (MAO A) Monoamine oxidase type A (MAOA)
Type:
Protein
Mol. Mass.:
59689.53
Organism:
Homo sapiens (Human)
Description:
P21397
Residue:
527
  
Inhibitor
Name:
BDBM50158875
Synonyms:
CHEMBL3787372 | US9676701, 69 N-(4′-((trans)-2-aminocyclopropyl)biphenyl-3-yl)propane-2-sulfonamide hydrochloride
Type:
Small organic molecule
Emp. Form.:
C18H22N2O2S
Mol. Mass.:
330.444
SMILES:
CC(C)S(=O)(=O)Nc1cccc(c1)-c1ccc(cc1)[C@H]1C[C@@H]1N
: