Target
Acetylcholinesterase
Ligand
BDBM50161479
Substrate
Meas. Tech.
ChEMBL_1567404 (CHEMBL3790087)
Ki
0.830000±n/a nM
Citation
 Özgeris, BGöksu, SPolat Köse, LGülçin, ISalmas, REDurdagi, STümer, FSupuran, CT Acetylcholinesterase and carbonic anhydrase inhibitory properties of novel urea and sulfamide derivatives incorporating dopaminergic 2-aminotetralin scaffolds. Bioorg Med Chem 24:2318-29 (2016)  
Target
Name:
Acetylcholinesterase
Synonyms:
ACES_HUMAN Acetylcholinesterase (AChE) | Acetylcholinesterase (human AChE)
Type:
Enzyme
Mol. Mass.:
67792.70
Organism:
Homo sapiens (Human)
Description:
P22303
Residue:
614
  
Inhibitor
Name:
BDBM50161479
Synonyms:
CHEMBL3786448
Type:
Small organic molecule
Emp. Form.:
C13H20N2O3S
Mol. Mass.:
284.374
SMILES:
COc1ccc2CCC(Cc2c1)NS(=O)(=O)N(C)C
: