Target
Transmembrane domain-containing protein TMIGD3
Ligand
BDBM50163884
Substrate
Meas. Tech.
ChEMBL_1573810 (CHEMBL3803231)
EC50
13±n/a nM
Citation
 Tosh, DKCiancetta, AWarnick, EO'Connor, RChen, ZGizewski, ECrane, SGao, ZGAuchampach, JASalvemini, DJacobson, KA Purine (N)-Methanocarba Nucleoside Derivatives Lacking an Exocyclic Amine as Selective A3 Adenosine Receptor Agonists. J Med Chem 59:3249-63 (2016)  
Target
Name:
Transmembrane domain-containing protein TMIGD3
Synonyms:
TMIG3_HUMAN Transmembrane domain-containing protein TMIGD3
Type:
PROTEIN
Mol. Mass.:
30335.79
Organism:
Homo sapiens (Human)
Description:
ChEMBL_114868
Residue:
266
  
Inhibitor
Name:
BDBM50163884
Synonyms:
CHEMBL3798200
Type:
Small organic molecule
Emp. Form.:
C20H18ClN5O3S
Mol. Mass.:
443.907
SMILES:
[H][C@]12C[C@]1([C@@H](O)[C@@H](O)[C@@H]2n1cnc2c(C)nc(nc12)C#Cc1ccc(Cl)s1)C(=O)NC
: