Target
D(2) dopamine receptor
Ligand
BDBM50056443
Substrate
Meas. Tech.
ChEMBL_1576315 (CHEMBL3801665)
Ki
17±n/a nM
Citation
 Zou, MFKeck, TMKumar, VDonthamsetti, PMichino, MBurzynski, CSchweppe, CBonifazi, AFree, RBSibley, DRJanowsky, AShi, LJavitch, JANewman, AH Novel Analogues of (R)-5-(Methylamino)-5,6-dihydro-4H-imidazo[4,5,1-ij]quinolin-2(1H)-one (Sumanirole) Provide Clues to Dopamine D2/D3 Receptor Agonist Selectivity. J Med Chem 59:2973-88 (2016)  
Target
Name:
D(2) dopamine receptor
Synonyms:
D(2) dopamine receptor DOPAMINE D2 Long DRD2 Dopamine D2 receptor Dopamine D2 receptor (D2R) Dopamine2-like | d2
Type:
Cell-surface receptors
Mol. Mass.:
50647.10
Organism:
Homo sapiens (Human)
Description:
P14416
Residue:
443
  
Inhibitor
Name:
BDBM50056443
Synonyms:
(R)-5-Methylamino-5,6-dihydro-1H,4H-imidazo[4,5,1-ij]quinolin-2-one PNU-95666E
Type:
Small organic molecule
Emp. Form.:
C11H13N3O
Mol. Mass.:
203.2404
SMILES:
CN[C@@H]1Cc2cccc3[nH]c(=O)n(C1)c23
: