Target
Leucine-rich repeat serine/threonine-protein kinase 2
Ligand
BDBM50165996
Substrate
Meas. Tech.
ChEMBL_1575146 (CHEMBL3804654)
Ki
28±n/a nM
Citation
 Greshock, TJSanders, JMDrolet, RERajapakse, HAChang, RKKim, BRada, VLTiscia, HESu, HLai, MTSur, SMSanchez, RIBilodeau, MTRenger, JJKern, JTMcCauley, JA Potent, selective and orally bioavailable leucine-rich repeat kinase 2 (LRRK2) inhibitors. Bioorg Med Chem Lett 26:2631-5 (2016)  
Target
Name:
Leucine-rich repeat serine/threonine-protein kinase 2
Synonyms:
Dardarin LRRK2_HUMAN Leucine-rich repeat serine/threonine-protein kinase 2 PARK8
Type:
Protein
Mol. Mass.:
286113.20
Organism:
Homo sapiens (Human)
Description:
Q5S007
Residue:
2527
  
Inhibitor
Name:
BDBM50165996
Synonyms:
CHEMBL3797298
Type:
Small organic molecule
Emp. Form.:
C16H19N3OS2
Mol. Mass.:
333.472
SMILES:
CC[C@H]1CNC(=O)c2c(SCC3CC3)sc(-c3cc[nH]n3)c12
: