Target
Leucine-rich repeat serine/threonine-protein kinase 2
Ligand
BDBM50165986
Substrate
Meas. Tech.
ChEMBL_1575146 (CHEMBL3804654)
Ki
97±n/a nM
Citation
 Greshock, TJSanders, JMDrolet, RERajapakse, HAChang, RKKim, BRada, VLTiscia, HESu, HLai, MTSur, SMSanchez, RIBilodeau, MTRenger, JJKern, JTMcCauley, JA Potent, selective and orally bioavailable leucine-rich repeat kinase 2 (LRRK2) inhibitors. Bioorg Med Chem Lett 26:2631-5 (2016)  
Target
Name:
Leucine-rich repeat serine/threonine-protein kinase 2
Synonyms:
Dardarin LRRK2_HUMAN Leucine-rich repeat serine/threonine-protein kinase 2 PARK8
Type:
Protein
Mol. Mass.:
286113.20
Organism:
Homo sapiens (Human)
Description:
Q5S007
Residue:
2527
  
Inhibitor
Name:
BDBM50165986
Synonyms:
CHEMBL3798511
Type:
Small organic molecule
Emp. Form.:
C18H23N3OS
Mol. Mass.:
329.46
SMILES:
CC1(C)Cc2c(sc(NC3CCCC3)c2C(=O)C1)-c1cc[nH]n1
: