Target
Beta-2 adrenergic receptor
Ligand
BDBM50167067
Substrate
Meas. Tech.
ChEMBL_1573519 (CHEMBL3801474)
Ki
23±n/a nM
Citation
 Weichert, DStanek, MHübner, HGmeiner, P Structure-guided development of dualß2 adrenergic/dopamine D2 receptor agonists. Bioorg Med Chem 24:2641-53 (2016)  
Target
Name:
Beta-2 adrenergic receptor
Synonyms:
ADRB2 ADRB2_HUMAN Beta-2 adrenoceptor | Beta-2 adrenoreceptor
Type:
Mol. Mass.:
46461.69
Organism:
Homo sapiens (Human)
Description:
P07550
Residue:
413
  
Inhibitor
Name:
BDBM50167067
Synonyms:
CHEMBL3800468
Type:
Small organic molecule
Emp. Form.:
C29H32N2O5
Mol. Mass.:
488.5748
SMILES:
COc1cc(CCNC[C@@H](O)c2ccc(O)c3[nH]c(=O)ccc23)ccc1OCCCc1ccccc1
: