Target
Beta-2 adrenergic receptor
Ligand
BDBM50167063
Substrate
Meas. Tech.
ChEMBL_1573519 (CHEMBL3801474)
Ki
2.8±n/a nM
Citation
 Weichert, DStanek, MHübner, HGmeiner, P Structure-guided development of dualß2 adrenergic/dopamine D2 receptor agonists. Bioorg Med Chem 24:2641-53 (2016)  
Target
Name:
Beta-2 adrenergic receptor
Synonyms:
ADRB2 ADRB2_HUMAN Beta-2 adrenoceptor | Beta-2 adrenoreceptor
Type:
Mol. Mass.:
46461.69
Organism:
Homo sapiens (Human)
Description:
P07550
Residue:
413
  
Inhibitor
Name:
BDBM50167063
Synonyms:
CHEMBL3800341
Type:
Small organic molecule
Emp. Form.:
C28H32N2O5
Mol. Mass.:
476.5641
SMILES:
COc1cc(CCNCCc2ccc(O)c3NC(=O)COc23)ccc1OCCCc1ccccc1
: