Target
D(1A) dopamine receptor
Ligand
BDBM50166979
Substrate
Meas. Tech.
ChEMBL_1573520 (CHEMBL3801475)
Ki
4500±n/a nM
Citation
 Weichert, DStanek, MHübner, HGmeiner, P Structure-guided development of dualß2 adrenergic/dopamine D2 receptor agonists. Bioorg Med Chem 24:2641-53 (2016)  
Target
Name:
D(1A) dopamine receptor
Synonyms:
DA D1 receptor DRD1 Dopamine D1 receptor Dopamine D1A
Type:
Enzyme
Mol. Mass.:
49303.43
Organism:
Homo sapiens (Human)
Description:
P21728
Residue:
446
  
Inhibitor
Name:
BDBM50166979
Synonyms:
CHEMBL3798748
Type:
Small organic molecule
Emp. Form.:
C28H32N2O6
Mol. Mass.:
492.5635
SMILES:
COc1cc(CCNC[C@H](O)c2ccc(O)c3NC(=O)COc23)ccc1OCCCc1ccccc1
: