Target
Beta-1 adrenergic receptor
Ligand
BDBM50167063
Substrate
Meas. Tech.
ChEMBL_1573518 (CHEMBL3801473)
Ki
79±n/a nM
Citation
 Weichert, DStanek, MHübner, HGmeiner, P Structure-guided development of dualß2 adrenergic/dopamine D2 receptor agonists. Bioorg Med Chem 24:2641-53 (2016)  
Target
Name:
Beta-1 adrenergic receptor
Synonyms:
ADRB1_MOUSE Adrb1r Beta-1 adrenergic receptor Beta-1 adrenoreceptor
Type:
PROTEIN
Mol. Mass.:
50507.75
Organism:
Mus musculus
Description:
ChEMBL_105090
Residue:
466
  
Inhibitor
Name:
BDBM50167063
Synonyms:
CHEMBL3800341
Type:
Small organic molecule
Emp. Form.:
C28H32N2O5
Mol. Mass.:
476.5641
SMILES:
COc1cc(CCNCCc2ccc(O)c3NC(=O)COc23)ccc1OCCCc1ccccc1
: