Target
Alpha-1A adrenergic receptor
Ligand
BDBM50171400
Substrate
Meas. Tech.
ChEMBL_1576968 (CHEMBL3806811)
IC50
120±n/a nM
Citation
 Yang, FJiang, XLi, JWang, YLiu, YBi, MWu, CZhao, QChen, WYin, JZhang, JXie, YHu, TXu, MGuo, SWang, ZHe, YShen, J Synthesis, structure-activity relationships, and biological evaluation of a series of benzamides as potential multireceptor antipsychotics. Bioorg Med Chem Lett 26:3141-7 (2016)  
Target
Name:
Alpha-1A adrenergic receptor
Synonyms:
ADA1A_HUMAN ADRA1C Alpha 1A-adrenoceptor Alpha adrenergic receptor 1a Alpha-adrenergic receptor 1c adrenergic Alpha1 | adrenergic Alpha1C
Type:
Cell-surface receptors
Mol. Mass.:
51511.67
Organism:
Homo sapiens (Human)
Description:
P35348
Residue:
466
  
Inhibitor
Name:
BDBM50171400
Synonyms:
CHEMBL3805518
Type:
Small organic molecule
Emp. Form.:
C24H27F2N3O3
Mol. Mass.:
443.4863
SMILES:
CNC(=O)c1cc(OCCCCN2CCC(CC2)c2noc3cc(F)ccc23)ccc1F
: