Target
Glucose-dependent insulinotropic receptor
Ligand
BDBM50172073
Substrate
Meas. Tech.
ChEMBL_1580708 (CHEMBL3811154)
EC50
54±n/a nM
Citation
 Ritter, KBuning, CHalland, NPöverlein, CSchwink, L G Protein-Coupled Receptor 119 (GPR119) Agonists for the Treatment of Diabetes: Recent Progress and Prevailing Challenges. J Med Chem 59:3579-92 (2016)  
Target
Name:
Glucose-dependent insulinotropic receptor
Synonyms:
G-protein coupled receptor 119 (GPR119) GPR119 | Glucose-dependent insulinotropic receptor
Type:
Protein
Mol. Mass.:
36901.49
Organism:
Homo sapiens (Human)
Description:
Q8TDV5
Residue:
335
  
Inhibitor
Name:
BDBM50172073
Synonyms:
CHEMBL3809509
Type:
Small organic molecule
Emp. Form.:
C30H31F3N2O5S
Mol. Mass.:
588.638
SMILES:
C[C@@H](OC(=O)N1CCC2(CC1)CCc1cc(ccc1O2)-c1ccc(CS(=O)(=O)Cc2ccccn2)cc1)C(F)(F)F
: