Target
Tyrosine-protein kinase receptor UFO
Ligand
BDBM50172080
Substrate
Meas. Tech.
ChEMBL_1580727 (CHEMBL3811332)
IC50
56±n/a nM
Citation
 Myers, SHBrunton, VGUnciti-Broceta, A AXL Inhibitors in Cancer: A Medicinal Chemistry Perspective. J Med Chem 59:3593-608 (2016)  
Target
Name:
Tyrosine-protein kinase receptor UFO
Synonyms:
AXL TEL/AXL UFO | UFO_HUMAN
Type:
Enzyme
Mol. Mass.:
98316.97
Organism:
Homo sapiens (Human)
Description:
P30530
Residue:
894
  
Inhibitor
Name:
BDBM50172080
Synonyms:
CHEMBL3808948
Type:
Small organic molecule
Emp. Form.:
C22H22N4O4S
Mol. Mass.:
438.499
SMILES:
O=C1CSC(=O)N1Cc1ccc2NC(=O)\C(=C/c3cc(CN4CCOCC4)c[nH]3)c2c1
: