Target
Carbonic anhydrase 2
Ligand
BDBM50176610
Substrate
Meas. Tech.
ChEMBL_1579080 (CHEMBL3811428)
Ki
0.410000±n/a nM
Citation
 Abdel Gawad, NMAmin, NHElsaadi, MTMohamed, FMMAngeli, ADe Luca, VCapasso, CSupuran, CT Synthesis of 4-(thiazol-2-ylamino)-benzenesulfonamides with carbonic anhydrase I, II and IX inhibitory activity and cytotoxic effects against breast cancer cell lines. Bioorg Med Chem 24:3043-3051 (2016)  
Target
Name:
Carbonic anhydrase 2
Synonyms:
CA-II CAC Carbonate dehydratase II Carbonic anhydrase 2 (CA-II) Carbonic anhydrase C Carbonic anhydrase II (CA-II) Carbonic anhydrase II (hCA II) | Carbonic anhydrase isoenzyme II (hCA II)
Type:
Enzyme
Mol. Mass.:
29250.71
Organism:
Homo sapiens (Human)
Description:
P00918
Residue:
260
  
Inhibitor
Name:
BDBM50176610
Synonyms:
CHEMBL3808876
Type:
Small organic molecule
Emp. Form.:
C15H15N5O4S3
Mol. Mass.:
425.506
SMILES:
NS(=O)(=O)c1ccc(Nc2csc(Nc3ccc(cc3)S(N)(=O)=O)n2)cc1
: