Target
Cholesteryl ester transfer protein
Ligand
BDBM50178689
Substrate
Meas. Tech.
ChEMBL_1583725 (CHEMBL3815812)
IC50
48000±n/a nM
Citation
 Jiang, JFinlay, HJohnson, JAHarikrishnan, LKamau, MQiao, JWang, TAdam, LTaylor, DYang, RSleph, PChen, AYAYin, XWexler, RSalvati, ME Discovery of hydroxyl 1,2-diphenylethanamine analogs as potent cholesterol ester transfer protein inhibitors. Bioorg Med Chem Lett 26:3278-3281 (2016)  
Target
Name:
Cholesteryl ester transfer protein
Synonyms:
CETP Cholesteryl ester transfer protein (CETP) | Lipid transfer protein I
Type:
Enzyme
Mol. Mass.:
54751.53
Organism:
Homo sapiens (Human)
Description:
P11597
Residue:
493
  
Inhibitor
Name:
BDBM50178689
Synonyms:
CHEMBL3814561
Type:
Small organic molecule
Emp. Form.:
C24H20ClF7N2O
Mol. Mass.:
520.87
SMILES:
CO[C@H](CN[C@@](Cc1ccccc1)(c1cc(F)cc(c1)C(F)(F)F)c1ccc(Cl)cn1)C(F)(F)F
: