Target
5-hydroxytryptamine receptor 2A
Ligand
BDBM50183261
Substrate
Meas. Tech.
ChEMBL_1586236 (CHEMBL3820054)
Ki
168±n/a nM
Citation
 Etukala, JRZhu, XYEyunni, SVOnyameh, EKOfori, EBricker, BAKang, HJHuang, XPRoth, BLAblordeppey, SY Development of CNS multi-receptor ligands: Modification of known D2 pharmacophores. Bioorg Med Chem 24:3671-9 (2016)  
Target
Name:
5-hydroxytryptamine receptor 2A
Synonyms:
5-HT-2 5-HT2A 5-hydroxytryptamine receptor 2A (5HT-2A) 5HT2A_HUMAN HTR2A | Serotonin receptor 2A
Type:
undefined
Mol. Mass.:
52607.65
Organism:
Homo sapiens (Human)
Description:
P28223
Residue:
471
  
Inhibitor
Name:
BDBM50183261
Synonyms:
CHEMBL3819642
Type:
Small organic molecule
Emp. Form.:
C21H24Cl2N2OS
Mol. Mass.:
423.399
SMILES:
Cl.OC1(CCN(CCCc2nc3ccccc3s2)CC1)c1ccc(Cl)cc1
: