Target
72 kDa type IV collagenase
Ligand
BDBM50105458
Substrate
Meas. Tech.
ChEMBL_1589851 (CHEMBL3830608)
IC50
1.3±n/a nM
Citation
 Adhikari, NHalder, AKMallick, SSaha, ASaha, KDJha, T Robust design of some selective matrix metalloproteinase-2 inhibitors over matrix metalloproteinase-9 through in silico/fragment-based lead identification and de novo lead modification: Syntheses and biological assays. Bioorg Med Chem 24:4291-4309 (2016)  
Target
Name:
72 kDa type IV collagenase
Synonyms:
72 kDa gelatinase CLG4A Gelatinase A (MMP-2) MMP2_HUMAN Matrix metalloproteinase-2 (MMP 2) Matrix metalloproteinases 2 (MMP-2) | TBE-1
Type:
Enzyme
Mol. Mass.:
73870.36
Organism:
Homo sapiens (Human)
Description:
P08253
Residue:
660
  
Inhibitor
Name:
BDBM50105458
Synonyms:
CHEMBL433171 | N-Hydroxy-2-methyl-2-phenethylamino-3-(4-phenoxy-benzenesulfonyl)-propionamide
Type:
Small organic molecule
Emp. Form.:
C24H26N2O5S
Mol. Mass.:
454.539
SMILES:
CC(CS(=O)(=O)c1ccc(Oc2ccccc2)cc1)(NCCc1ccccc1)C(=O)NO
: