Target
Toll-like receptor 7
Ligand
BDBM50189281
Substrate
Meas. Tech.
ChEMBL_1591130 (CHEMBL3829200)
EC50
240±n/a nM
Citation
 Cortez, ALi, YMiller, ATZhang, XYue, KMaginnis, JHampton, JHall, de SShapiro, MNayak, BD'Oro, ULi, CSkibinski, DMbow, MLSingh, MO'Hagan, DTCooke, MPValiante, NMWu, TY Incorporation of Phosphonate into Benzonaphthyridine Toll-like Receptor 7 Agonists for Adsorption to Aluminum Hydroxide. J Med Chem 59:5868-78 (2016)  
Target
Name:
Toll-like receptor 7
Synonyms:
ORF Names:UNQ248/PRO285 TLR7_HUMAN | Toll-like receptor 7 (TLR7)
Type:
Enzyme
Mol. Mass.:
120945.35
Organism:
Homo sapiens (Human)
Description:
Q9NYK1
Residue:
1049
  
Inhibitor
Name:
BDBM50189281
Synonyms:
CHEMBL3827669 | US9597326, Compound 16
Type:
Small organic molecule
Emp. Form.:
C28H30F2N3O6P
Mol. Mass.:
573.5249
SMILES:
Cc1cc(OCCCC(F)(F)P(O)(O)=O)ccc1CCc1cnc2c(N)nc3cc(CCC(O)=O)ccc3c2c1
: