Target
Bromodomain-containing protein 1
Ligand
BDBM50189403
Substrate
Meas. Tech.
ChEMBL_1589341 (CHEMBL3830585)
IC50
7943±n/a nM
Citation
 Bamborough, PBarnett, HABecher, IBird, MJChung, CWCraggs, PDDemont, EHDiallo, HFallon, DJGordon, LJGrandi, PHobbs, CIHooper-Greenhill, EJones, EJLaw, RPLe Gall, ALugo, DMichon, AMMitchell, DJPrinjha, RKSheppard, RJWatson, AJWatson, RJ GSK6853, a Chemical Probe for Inhibition of the BRPF1 Bromodomain. ACS Med Chem Lett 7:552-7 (2016)  
Target
Name:
Bromodomain-containing protein 1
Synonyms:
BR140-like protein BRD1_HUMAN BRL Bromodomain and PHD finger-containing protein 2 | Bromodomain-containing protein 1
Type:
PROTEIN
Mol. Mass.:
119557.65
Organism:
Homo sapiens (Human)
Description:
ChEMBL_105349
Residue:
1058
  
Inhibitor
Name:
BDBM50189403
Synonyms:
CHEMBL3828191
Type:
Small organic molecule
Emp. Form.:
C22H27N5O3
Mol. Mass.:
409.4815
SMILES:
COc1ccccc1C(=O)Nc1cc2n(C)c(=O)n(C)c2cc1N1CCNC[C@H]1C
: