Target
NAD-dependent protein deacetylase sirtuin-1
Ligand
BDBM50193044
Substrate
Meas. Tech.
ChEMBL_1614255 (CHEMBL3856324)
IC50
32000±n/a nM
Citation
 Kumar, AChauhan, S How much successful are the medicinal chemists in modulation of SIRT1: A critical review. Eur J Med Chem 119:45-69 (2016)  
Target
Name:
NAD-dependent protein deacetylase sirtuin-1
Synonyms:
NAD-Dependent Deacetylase Sirtuin-1 NAD-dependent protein deacetylase sirtuin-1 (SIRT1) SIR2-like protein 1 SIRT1 Sirtuin-1 (SIRT1) | hSIR2
Type:
Developmental protein; hydrolase
Mol. Mass.:
81626.66
Organism:
Homo sapiens (Human)
Description:
Residue:
747
  
Inhibitor
Name:
BDBM50193044
Synonyms:
CHEMBL3942319
Type:
Small organic molecule
Emp. Form.:
C21H16ClN3O3
Mol. Mass.:
393.823
SMILES:
Oc1ccccc1-c1nc2ccc(Cl)cn2c1NCc1ccc2OCOc2c1
: