Target
NAD-dependent protein deacetylase sirtuin-1
Ligand
BDBM50337278
Substrate
Meas. Tech.
ChEMBL_1614247 (CHEMBL3856316)
IC50
68000±n/a nM
Citation
 Kumar, AChauhan, S How much successful are the medicinal chemists in modulation of SIRT1: A critical review. Eur J Med Chem 119:45-69 (2016)  
Target
Name:
NAD-dependent protein deacetylase sirtuin-1
Synonyms:
NAD-Dependent Deacetylase Sirtuin-1 NAD-dependent protein deacetylase sirtuin-1 (SIRT1) SIR2-like protein 1 SIRT1 Sirtuin-1 (SIRT1) | hSIR2
Type:
Developmental protein; hydrolase
Mol. Mass.:
81626.66
Organism:
Homo sapiens (Human)
Description:
Residue:
747
  
Inhibitor
Name:
BDBM50337278
Synonyms:
2-(phenylamino)benzoic acid CHEMBL23832 US9271961, 2 | phenylanthranilic acid
Type:
Small organic molecule
Emp. Form.:
C13H11NO2
Mol. Mass.:
213.2319
SMILES:
OC(=O)c1ccccc1Nc1ccccc1
: