Target
NAD-dependent protein deacetylase sirtuin-1
Ligand
BDBM50193075
Substrate
Meas. Tech.
ChEMBL_1614263 (CHEMBL3856332)
IC50
3100±n/a nM
Citation
 Kumar, AChauhan, S How much successful are the medicinal chemists in modulation of SIRT1: A critical review. Eur J Med Chem 119:45-69 (2016)  
Target
Name:
NAD-dependent protein deacetylase sirtuin-1
Synonyms:
NAD-Dependent Deacetylase Sirtuin-1 NAD-dependent protein deacetylase sirtuin-1 (SIRT1) SIR2-like protein 1 SIRT1 Sirtuin-1 (SIRT1) | hSIR2
Type:
Developmental protein; hydrolase
Mol. Mass.:
81626.66
Organism:
Homo sapiens (Human)
Description:
Residue:
747
  
Inhibitor
Name:
BDBM50193075
Synonyms:
CHEMBL3902988
Type:
Small organic molecule
Emp. Form.:
C14H15NO2
Mol. Mass.:
229.2744
SMILES:
Cc1ccc2[nH]c3C(CCCc3c2c1)C(O)=O
: