Target
NAD-dependent protein deacetylase sirtuin-1
Ligand
BDBM50193078
Substrate
Meas. Tech.
ChEMBL_1614268 (CHEMBL3856337)
IC50
7000±n/a nM
Citation
 Kumar, AChauhan, S How much successful are the medicinal chemists in modulation of SIRT1: A critical review. Eur J Med Chem 119:45-69 (2016)  
Target
Name:
NAD-dependent protein deacetylase sirtuin-1
Synonyms:
NAD-Dependent Deacetylase Sirtuin-1 NAD-dependent protein deacetylase sirtuin-1 (SIRT1) SIR2-like protein 1 SIRT1 Sirtuin-1 (SIRT1) | hSIR2
Type:
Developmental protein; hydrolase
Mol. Mass.:
81626.66
Organism:
Homo sapiens (Human)
Description:
Residue:
747
  
Inhibitor
Name:
BDBM50193078
Synonyms:
CHEMBL3956664
Type:
Small organic molecule
Emp. Form.:
C37H54O6
Mol. Mass.:
594.8211
SMILES:
[#6]-[#6](-[#6])-[#6](=O)[C@@]12[#6](=O)-[#6](-[#6]\[#6]=[#6](/[#6])-[#6])=[#6](-[#8]-[#6]-[#6](-[#8])=O)[C@@]([#6]\[#6]=[#6](\[#6])-[#6])([#6]-[#6@H](-[#6]\[#6]=[#6](\[#6])-[#6])[C@@]1([#6])[#6]-[#6]\[#6]=[#6](/[#6])-[#6])[#6]2=O
: