Target
Cyclin-dependent kinase 5 activator 1
Ligand
BDBM6309
Substrate
Meas. Tech.
ChEMBL_1614395 (CHEMBL3856464)
IC50
>10000±n/a nM
Citation
 Sonawane, YATaylor, MANapoleon, JVRana, SContreras, JINatarajan, A Cyclin Dependent Kinase 9 Inhibitors for Cancer Therapy. J Med Chem 59:8667-8684 (2016)  
Target
Name:
Cyclin-dependent kinase 5 activator 1
Synonyms:
CDK5/p35 Cyclin-dependent kinase 5 regulatory subunit 1 | Cyclin-dependent kinase 5/CDK5 activator 1
Type:
Protein Complex
Mol. Mass.:
Description:
Components:
This complex has 2 components.
Component 1
Name:
Cyclin-dependent kinase 5
Synonyms:
CDK5 CDKN5 Cyclin-dependent kinase 5 (CDK5/ p25) Cyclin-dependent-like kinase 5 PSSALRE Tau protein kinase II catalytic subunit
Type:
Enzyme Subunit
Mol. Mass.:
33308.61
Organism:
Homo sapiens (Human)
Description:
Residue:
292
  
Component 2
Name:
Cyclin-dependent kinase 5 activator 1
Synonyms:
CD5R1_HUMAN CDK5R1 Cyclin-dependent kinase 5 (CDK5/p25) NCK5A p35
Type:
Enzyme Subunit
Mol. Mass.:
34077.43
Organism:
Homo sapiens (Human)
Description:
Q15078
Residue:
307
  
Inhibitor
Name:
BDBM6309
Synonyms:
6-Acetyl-8-cyclopentyl-5-methyl-2-(5-piperazin-1-yl-pyridin-2-ylamino)-8H-pyrido[2,3-d]pyrimidin-7-one Hydrochloride Ibrance Palbociclib US10189849, PD0332991 US10626107, Example Palbociclib US10927120, PD0332991 US9957276, PD0332991
Type:
Small organic molecule
Emp. Form.:
C24H29N7O2
Mol. Mass.:
447.5328
SMILES:
CC(=O)c1c(C)c2cnc(Nc3ccc(cn3)N3CCNCC3)nc2n(C2CCCC2)c1=O
: