Target
G1/S-specific cyclin-D2
Ligand
BDBM6309
Substrate
Meas. Tech.
ChEMBL_1614396 (CHEMBL3856465)
IC50
15±n/a nM
Citation
 Sonawane, YATaylor, MANapoleon, JVRana, SContreras, JINatarajan, A Cyclin Dependent Kinase 9 Inhibitors for Cancer Therapy. J Med Chem 59:8667-8684 (2016)  
Target
Name:
G1/S-specific cyclin-D2
Synonyms:
CCND2 CDK6/cyclin D2 | G1/S-specific cyclin-D2
Type:
PROTEIN
Mol. Mass.:
33058.33
Organism:
Homo sapiens (Human)
Description:
ChEMBL_108400
Residue:
289
  
Inhibitor
Name:
BDBM6309
Synonyms:
6-Acetyl-8-cyclopentyl-5-methyl-2-(5-piperazin-1-yl-pyridin-2-ylamino)-8H-pyrido[2,3-d]pyrimidin-7-one Hydrochloride Ibrance Palbociclib US10189849, PD0332991 US10626107, Example Palbociclib US10927120, PD0332991 US9957276, PD0332991
Type:
Small organic molecule
Emp. Form.:
C24H29N7O2
Mol. Mass.:
447.5328
SMILES:
CC(=O)c1c(C)c2cnc(Nc3ccc(cn3)N3CCNCC3)nc2n(C2CCCC2)c1=O
: