Target
Epidermal growth factor receptor
Ligand
BDBM50196095
Substrate
Meas. Tech.
ChEMBL_1618202 (CHEMBL3860371)
IC50
250±n/a nM
Citation
 Lelais, GEpple, RMarsilje, THLong, YOMcNeill, MChen, BLu, WAnumolu, JBadiger, SBursulaya, BDiDonato, MFong, RJuarez, JLi, JManuia, MMason, DEGordon, PGroessl, TJohnson, KJia, YKasibhatla, SLi, CIsbell, JSpraggon, GBender, SMichellys, PY Discovery of (R,E)-N-(7-Chloro-1-(1-[4-(dimethylamino)but-2-enoyl]azepan-3-yl)-1H-benzo[d]imidazol-2-yl)-2-methylisonicotinamide (EGF816), a Novel, Potent, and WT Sparing Covalent Inhibitor of Oncogenic (L858R, ex19del) and Resistant (T790M) EGFR Mutants for the Treatment of EGFR Mutant Non-Small-Ce J Med Chem 59:6671-89 (2016)  
Target
Name:
Epidermal growth factor receptor
Synonyms:
EGF Receptor Substrate EGFR_HUMAN ERBB1 Epidermal Growth Factor Receptor erbB-1 Epidermal growth factor receptor (EGFR) HER1 Proto-oncogene c-ErbB-1 Tyrosine-Protein Kinase ErbB-1
Type:
Receptor Kinase Domain
Mol. Mass.:
134279.59
Organism:
Homo sapiens (Human)
Description:
P00533
Residue:
1210
  
Inhibitor
Name:
BDBM50196095
Synonyms:
CHEMBL3972316
Type:
Small organic molecule
Emp. Form.:
C25H25F3N4O2
Mol. Mass.:
470.4868
SMILES:
Cc1cccc2nc(NC(=O)c3cccc(c3)C(F)(F)F)n([C@@H]3CCCCN(C3)C(=O)C=C)c12
: