Target
Cytochrome P450 2C19
Ligand
BDBM50199463
Substrate
Meas. Tech.
ChEMBL_1621611 (CHEMBL3863894)
IC50
>30000±n/a nM
Citation
 Tosh, DKCiancetta, AWarnick, ECrane, SGao, ZGJacobson, KA Structure-Based Scaffold Repurposing for G Protein-Coupled Receptors: Transformation of Adenosine Derivatives into 5HT J Med Chem 59:11006-11026 (2016)  
Target
Name:
Cytochrome P450 2C19
Synonyms:
CP2CJ_HUMAN CYPIIC17 Cytochrome P450 2C19 (CYP2C19) Mephenytoin 4-hydroxylase P450-254C
Type:
Enzyme
Mol. Mass.:
55935.47
Organism:
Homo sapiens (Human)
Description:
P33261
Residue:
490
  
Inhibitor
Name:
BDBM50199463
Synonyms:
CHEMBL3976121
Type:
Small organic molecule
Emp. Form.:
C20H25ClN6O3
Mol. Mass.:
432.904
SMILES:
[H][C@]12C[C@]1([C@@H](O)[C@@H](O)[C@@H]2n1cnc2c(NC(C3CC3)C3CC3)nc(Cl)nc12)C(=O)NC
: