Target
Transmembrane domain-containing protein TMIGD3
Ligand
BDBM50379107
Substrate
Meas. Tech.
ChEMBL_1621587 (CHEMBL3863870)
Ki
470±n/a nM
Citation
 Tosh, DKCiancetta, AWarnick, ECrane, SGao, ZGJacobson, KA Structure-Based Scaffold Repurposing for G Protein-Coupled Receptors: Transformation of Adenosine Derivatives into 5HT J Med Chem 59:11006-11026 (2016)  
Target
Name:
Transmembrane domain-containing protein TMIGD3
Synonyms:
TMIG3_HUMAN Transmembrane domain-containing protein TMIGD3
Type:
PROTEIN
Mol. Mass.:
30335.79
Organism:
Homo sapiens (Human)
Description:
ChEMBL_114868
Residue:
266
  
Inhibitor
Name:
BDBM50379107
Synonyms:
CHEMBL2012686
Type:
Small organic molecule
Emp. Form.:
C18H22ClN5O2
Mol. Mass.:
375.853
SMILES:
O[C@@H]1[C@@H]2C[C@@H]2[C@H]([C@@H]1O)n1cnc2c(NC(C3CC3)C3CC3)nc(Cl)nc12
: